Target
Cholinesterase
Ligand
BDBM50018226
Substrate
Meas. Tech.
ChEBML_41436
Ki
800±n/a nM
Citation
 Leader, HSmejkal, RMPayne, CSPadilla, FNDoctor, BPGordon, RKChiang, PK Binary antidotes for organophosphate poisoning: aprophen analogues that are both antimuscarinics and carbamates. J Med Chem 32:1522-8 (1989)  
Target
Name:
Cholinesterase
Synonyms:
Acylcholine acylhydrolase Butyrylcholine esterase (BChE) Butyrylcholinesterase (BuChE) CHLE_HUMAN Cholinesterases Pseudocholinesterase
Type:
Homotetramer
Mol. Mass.:
68422.27
Organism:
Homo sapiens (Human)
Description:
P06276
Residue:
602
  
Inhibitor
Name:
BDBM50018226
Synonyms:
2-(4-Dimethylcarbamoyloxy-phenyl)-2-(4-hydroxy-phenyl)-propionic acid 2-diethylamino-ethyl ester | CHEMBL288482
Type:
Small organic molecule
Emp. Form.:
C24H32N2O5
Mol. Mass.:
428.5213
SMILES:
CCN(CC)CCOC(=O)C(C)(c1ccc(O)cc1)c1ccc(OC(=O)N(C)C)cc1
: