Target
Muscarinic acetylcholine receptor M2
Ligand
BDBM50018227
Substrate
Meas. Tech.
ChEBML_140183
Ki
4900±n/a nM
Citation
 Leader, HSmejkal, RMPayne, CSPadilla, FNDoctor, BPGordon, RKChiang, PK Binary antidotes for organophosphate poisoning: aprophen analogues that are both antimuscarinics and carbamates. J Med Chem 32:1522-8 (1989)  
Target
Name:
Muscarinic acetylcholine receptor M2
Synonyms:
ACM2_RAT Chrm-2 | Chrm2
Type:
Enzyme Catalytic Domain
Mol. Mass.:
51555.53
Organism:
RAT
Description:
P10980
Residue:
466
  
Inhibitor
Name:
BDBM50018227
Synonyms:
2,2-Bis-(4-hydroxy-phenyl)-propionic acid 2-diethylamino-ethyl ester | CHEMBL39342
Type:
Small organic molecule
Emp. Form.:
C21H27NO4
Mol. Mass.:
357.4434
SMILES:
CCN(CC)CCOC(=O)C(C)(c1ccc(O)cc1)c1ccc(O)cc1
: