Target
Adenosine receptor A1
Ligand
BDBM50367893
Substrate
Meas. Tech.
ChEMBL_29632 (CHEMBL639739)
Ki
19±n/a nM
Citation
 Trivedi, BKBruns, RF C2,N6-disubstituted adenosines: synthesis and structure-activity relationships. J Med Chem 32:1667-73 (1989)  
Target
Name:
Adenosine receptor A1
Synonyms:
AA1R_RAT ADENOSINE A1 high Adenosine A1 receptor (A1) Adenosine receptors A1 | Adora1
Type:
Protein
Mol. Mass.:
36704.13
Organism:
Rattus norvegicus (rat)
Description:
Residue:
326
  
Inhibitor
Name:
BDBM50367893
Synonyms:
CHEMBL603991
Type:
Small organic molecule
Emp. Form.:
C19H24N6O4
Mol. Mass.:
400.4317
SMILES:
CC(Cc1ccccc1)Nc1nc(N)nc2n(cnc12)C1O[C@H](CO)[C@@H](O)[C@H]1O
: