Target
Aromatase
Ligand
BDBM50014753
Substrate
Meas. Tech.
ChEBML_51212
EC50
200±n/a nM
Citation
 Jones, CDWinter, MAHirsch, KSStamm, NTaylor, HMHolden, HEDavenport, JDKrumkalns, EVSuhr, RG Estrogen synthetase inhibitors. 2. Comparison of the in vitro aromatase inhibitory activity for a variety of nitrogen heterocycles substituted with diarylmethane or diarylmethanol groups. J Med Chem 33:416-29 (1990)  
Target
Name:
Aromatase
Synonyms:
Arom CP19A_RAT Cyp19 Cytochrome P450 19A1 P-450AROM
Type:
PROTEIN
Mol. Mass.:
58418.09
Organism:
Rattus norvegicus
Description:
ChEMBL_51211
Residue:
508
  
Inhibitor
Name:
BDBM50014753
Synonyms:
3-[Chloro-bis-(4-chloro-phenyl)-methyl]-pyridine : (Hydrochloride) | CHEMBL334958
Type:
Small organic molecule
Emp. Form.:
C18H12Cl3N
Mol. Mass.:
348.654
SMILES:
Clc1ccc(cc1)C(Cl)(c1ccc(Cl)cc1)c1cccnc1
: