Target
Sodium-dependent dopamine transporter
Ligand
BDBM50015692
Substrate
Meas. Tech.
ChEBML_49342
IC50
137±n/a nM
Citation
 Kline, RHWright, JFox, KMEldefrawi, ME Synthesis of 3-arylecgonine analogues as inhibitors of cocaine binding and dopamine uptake. J Med Chem 33:2024-7 (1990)  
Target
Name:
Sodium-dependent dopamine transporter
Synonyms:
Dopamine transporter SLC6A3 | Sodium-dependent dopamine transporter
Type:
Enzyme Catalytic Domain
Mol. Mass.:
75707.43
Organism:
BOVINE
Description:
Dopamine Transporter SLC6A3 BOVINE::P27922
Residue:
693
  
Inhibitor
Name:
BDBM50015692
Synonyms:
8-Methyl-3-(4-nitro-phenyl)-8-aza-bicyclo[3.2.1]octane-2-carboxylic acid methyl ester | CHEMBL60609
Type:
Small organic molecule
Emp. Form.:
C16H20N2O4
Mol. Mass.:
304.341
SMILES:
COC(=O)C1C2CCC(CC1c1ccc(cc1)[N+]([O-])=O)N2C
: