Target
Sodium-dependent dopamine transporter
Ligand
BDBM50015694
Substrate
Meas. Tech.
ChEBML_49342
IC50
11000±n/a nM
Citation
 Kline, RHWright, JFox, KMEldefrawi, ME Synthesis of 3-arylecgonine analogues as inhibitors of cocaine binding and dopamine uptake. J Med Chem 33:2024-7 (1990)  
Target
Name:
Sodium-dependent dopamine transporter
Synonyms:
Dopamine transporter SLC6A3 | Sodium-dependent dopamine transporter
Type:
Enzyme Catalytic Domain
Mol. Mass.:
75707.43
Organism:
BOVINE
Description:
Dopamine Transporter SLC6A3 BOVINE::P27922
Residue:
693
  
Inhibitor
Name:
BDBM50015694
Synonyms:
3-(2,4-Dinitro-phenyl)-8-methyl-8-aza-bicyclo[3.2.1]octane-2-carboxylic acid methyl ester | CHEMBL62608
Type:
Small organic molecule
Emp. Form.:
C16H19N3O6
Mol. Mass.:
349.3386
SMILES:
COC(=O)C1C2CCC(CC1c1ccc(cc1[N+]([O-])=O)[N+]([O-])=O)N2C
: