Target
Muscarinic acetylcholine receptor M1
Ligand
BDBM50015719
Substrate
Meas. Tech.
ChEBML_138933
Kd
3.6±n/a nM
Citation
 Cereda, EEzhaya, AGil Quintero, MBellora, EDubini, EMicheletti, RSchiavone, ABrambilla, ASchiavi, GBDonetti, A Synthesis and biological evaluation of new antimuscarinic compounds with amidine basic centers. A useful bioisosteric replacement of classical cationic heads. J Med Chem 33:2108-13 (1990)  
Target
Name:
Muscarinic acetylcholine receptor M1
Synonyms:
ACM1_RAT Chrm-1 cholinergic receptor, muscarinic 1
Type:
Enzyme Catalytic Domain
Mol. Mass.:
51390.46
Organism:
RAT
Description:
P08482
Residue:
460
  
Inhibitor
Name:
BDBM50015719
Synonyms:
3-Hydroxy-2-phenyl-propionic acid 9-iminomethyl-3-oxa-9-aza-tricyclo[3.3.1.0*2,4*]non-7-yl ester; hydrochloride | CHEMBL544993
Type:
Small organic molecule
Emp. Form.:
C17H20N2O4
Mol. Mass.:
316.3517
SMILES:
OCC(C(=O)OC1CC2C3OC3C(C1)N2C=N)c1ccccc1
: