Target
Muscarinic acetylcholine receptor M1
Ligand
BDBM50015725
Substrate
Meas. Tech.
ChEBML_138933
Kd
300±n/a nM
Citation
 Cereda, EEzhaya, AGil Quintero, MBellora, EDubini, EMicheletti, RSchiavone, ABrambilla, ASchiavi, GBDonetti, A Synthesis and biological evaluation of new antimuscarinic compounds with amidine basic centers. A useful bioisosteric replacement of classical cationic heads. J Med Chem 33:2108-13 (1990)  
Target
Name:
Muscarinic acetylcholine receptor M1
Synonyms:
ACM1_RAT Chrm-1 cholinergic receptor, muscarinic 1
Type:
Enzyme Catalytic Domain
Mol. Mass.:
51390.46
Organism:
RAT
Description:
P08482
Residue:
460
  
Inhibitor
Name:
BDBM50015725
Synonyms:
9-Butyl-7-(3-hydroxy-2-phenyl-propionyloxy)-9-methyl-3-oxa-9-azonia-tricyclo[3.3.1.0*2,4*]nonane; bromide(N-butyl scopolamine bromide) CHEMBL21823
Type:
Small organic molecule
Emp. Form.:
C21H30NO4
Mol. Mass.:
360.4667
SMILES:
CCCC[N+]1(C)C2CC(CC1C1OC21)OC(=O)C(CO)c1ccccc1
: