Target
Muscarinic acetylcholine receptor M1
Ligand
BDBM50015723
Substrate
Meas. Tech.
ChEBML_138933
Kd
7±n/a nM
Citation
 Cereda, EEzhaya, AGil Quintero, MBellora, EDubini, EMicheletti, RSchiavone, ABrambilla, ASchiavi, GBDonetti, A Synthesis and biological evaluation of new antimuscarinic compounds with amidine basic centers. A useful bioisosteric replacement of classical cationic heads. J Med Chem 33:2108-13 (1990)  
Target
Name:
Muscarinic acetylcholine receptor M1
Synonyms:
ACM1_RAT Chrm-1 cholinergic receptor, muscarinic 1
Type:
Enzyme Catalytic Domain
Mol. Mass.:
51390.46
Organism:
RAT
Description:
P08482
Residue:
460
  
Inhibitor
Name:
BDBM50015723
Synonyms:
3-Hydroxy-2-phenyl-propionic acid 8-carbamimidoyl-8-aza-bicyclo[3.2.1]oct-3-yl ester; hydrochloride | CHEMBL553894
Type:
Small organic molecule
Emp. Form.:
C17H23N3O3
Mol. Mass.:
317.3828
SMILES:
NC(=N)N1C2CCC1CC(C2)OC(=O)C(CO)c1ccccc1
: