Target
Muscarinic acetylcholine receptor M1
Ligand
BDBM50015728
Substrate
Meas. Tech.
ChEBML_138933
Kd
2.5±n/a nM
Citation
 Cereda, EEzhaya, AGil Quintero, MBellora, EDubini, EMicheletti, RSchiavone, ABrambilla, ASchiavi, GBDonetti, A Synthesis and biological evaluation of new antimuscarinic compounds with amidine basic centers. A useful bioisosteric replacement of classical cationic heads. J Med Chem 33:2108-13 (1990)  
Target
Name:
Muscarinic acetylcholine receptor M1
Synonyms:
ACM1_RAT Chrm-1 cholinergic receptor, muscarinic 1
Type:
Enzyme Catalytic Domain
Mol. Mass.:
51390.46
Organism:
RAT
Description:
P08482
Residue:
460
  
Inhibitor
Name:
BDBM50015728
Synonyms:
3-(3-Hydroxy-2-phenyl-propionyloxy)-8,8-dimethyl-8-azonia-bicyclo[3.2.1]octane; bromide(atropine methyl bromide) | CHEMBL63452
Type:
Small organic molecule
Emp. Form.:
C18H26NO3
Mol. Mass.:
304.4034
SMILES:
C[N+]1(C)C2CCC1CC(C2)OC(=O)C(CO)c1ccccc1
: