Target
D(1) dopamine receptor
Ligand
BDBM50008830
Substrate
Meas. Tech.
ChEBML_31418
Ki
247±n/a nM
Citation
 Michaelides, MRSchoenleber, RThomas, SYamamoto, DMBritton, DRMacKenzie, RKebabian, JW Synthesis and pharmacological evaluation of 1-(aminomethyl)-3,4-dihydro-5-hydroxy-1H-2-benzopyrans as dopamine D1 selective ligands. J Med Chem 34:2946-53 (1991)  
Target
Name:
D(1) dopamine receptor
Synonyms:
D(1) dopamine receptor Dopamine D1 receptor
Type:
Mol. Mass.:
40664.04
Organism:
Carassius auratus
Description:
Residue:
363
  
Inhibitor
Name:
BDBM50008830
Synonyms:
1-Aminomethyl-6-methoxy-3-phenyl-isochroman-5-ol; hydrochloride | CHEMBL555619
Type:
Small organic molecule
Emp. Form.:
C17H19NO3
Mol. Mass.:
285.3377
SMILES:
COc1ccc2[C@H](CN)O[C@@H](Cc2c1O)c1ccccc1
: