Target
D(1) dopamine receptor
Ligand
BDBM50008831
Substrate
Meas. Tech.
ChEBML_31418
Ki
121±n/a nM
Citation
 Michaelides, MRSchoenleber, RThomas, SYamamoto, DMBritton, DRMacKenzie, RKebabian, JW Synthesis and pharmacological evaluation of 1-(aminomethyl)-3,4-dihydro-5-hydroxy-1H-2-benzopyrans as dopamine D1 selective ligands. J Med Chem 34:2946-53 (1991)  
Target
Name:
D(1) dopamine receptor
Synonyms:
D(1) dopamine receptor Dopamine D1 receptor
Type:
Mol. Mass.:
40664.04
Organism:
Carassius auratus
Description:
Residue:
363
  
Inhibitor
Name:
BDBM50008831
Synonyms:
3-Cyclohexyl-6-methyl-1-methylaminomethyl-isochroman-5-ol; hydrobromide | CHEMBL544099
Type:
Small organic molecule
Emp. Form.:
C18H27NO2
Mol. Mass.:
289.4125
SMILES:
CNC[C@@H]1O[C@@H](Cc2c(O)c(C)ccc12)C1CCCCC1
: