Target
D(1) dopamine receptor
Ligand
BDBM50008824
Substrate
Meas. Tech.
ChEBML_31418
Ki
32±n/a nM
Citation
 Michaelides, MRSchoenleber, RThomas, SYamamoto, DMBritton, DRMacKenzie, RKebabian, JW Synthesis and pharmacological evaluation of 1-(aminomethyl)-3,4-dihydro-5-hydroxy-1H-2-benzopyrans as dopamine D1 selective ligands. J Med Chem 34:2946-53 (1991)  
Target
Name:
D(1) dopamine receptor
Synonyms:
D(1) dopamine receptor Dopamine D1 receptor
Type:
Mol. Mass.:
40664.04
Organism:
Carassius auratus
Description:
Residue:
363
  
Inhibitor
Name:
BDBM50008824
Synonyms:
1-Aminomethyl-6-bromo-3-phenyl-isochroman-5-ol; hydrochloride | CHEMBL543390
Type:
Small organic molecule
Emp. Form.:
C16H16BrNO2
Mol. Mass.:
334.208
SMILES:
NC[C@@H]1O[C@@H](Cc2c(O)c(Br)ccc12)c1ccccc1
: