Target
Muscarinic acetylcholine receptor M2
Ligand
BDBM50010095
Substrate
Meas. Tech.
ChEBML_140189
Ki
551±n/a nM
Citation
 Hudkins, RLDeHaven-Hudkins, DLStubbins, JF Muscarinic receptor binding profile of para-substituted caramiphen analogues. J Med Chem 34:2984-9 (1991)  
Target
Name:
Muscarinic acetylcholine receptor M2
Synonyms:
ACM2_RAT Chrm-2 | Chrm2
Type:
Enzyme Catalytic Domain
Mol. Mass.:
51555.53
Organism:
RAT
Description:
P10980
Residue:
466
  
Inhibitor
Name:
BDBM50010095
Synonyms:
1-(4-Pyrrolidin-1-yl-phenyl)-cyclopentanecarboxylic acid 2-diethylamino-ethyl ester; hydrochloride | CHEMBL542914
Type:
Small organic molecule
Emp. Form.:
C22H34N2O2
Mol. Mass.:
358.5176
SMILES:
CCN(CC)CCOC(=O)C1(CCCC1)c1ccc(cc1)N1CCCC1
: