Target
D(1A) dopamine receptor
Ligand
BDBM50010288
Substrate
Meas. Tech.
ChEBML_60185
Ki
16±n/a nM
Citation
 Bakthavachalam, VBaindur, NMadras, BKNeumeyer, JL Fluorescent probes for dopamine receptors: synthesis and characterization of fluorescein and 7-nitrobenz-2-oxa-1,3-diazol-4-yl conjugates of D-1 and D-2 receptor ligands. J Med Chem 34:3235-41 (1991)  
Target
Name:
D(1A) dopamine receptor
Synonyms:
DA D1 receptor DRD1 Dopamine D1 receptor Dopamine D1A
Type:
Enzyme
Mol. Mass.:
49303.43
Organism:
Homo sapiens (Human)
Description:
P21728
Residue:
446
  
Inhibitor
Name:
BDBM50010288
Synonyms:
5-[4-(7-bromo-8-hydroxy-3-methyl-2,3,4,5-tetrahydro-1H-benzo[d]azepin-1-yl)anilino(thioxo)methylamino]-3',6'-dihydroxyspiro[1,3-dihydroisobenzofuran-1,9'-(9'H-xanthene)]-3-one | CHEMBL321223
Type:
Small organic molecule
Emp. Form.:
C38H30BrN3O6S
Mol. Mass.:
736.63
SMILES:
CN1CCc2cc(Br)c(O)cc2C(C1)c1ccc(NC(=S)Nc2ccc3c(c2)C(=O)OC32c3ccc(O)cc3Oc3cc(O)ccc23)cc1
: