Target
Adenosine receptor A1
Ligand
BDBM50368180
Substrate
Meas. Tech.
ChEBML_29172
Ki
17±n/a nM
Citation
 Trivedi, BKBlankley, CJBristol, JAHamilton, HWPatt, WCKramer, WJJohnson, SABruns, RFCohen, DMRyan, MJ N6-substituted adenosine receptor agonists: potential antihypertensive agents. J Med Chem 34:1043-9 (1991)  
Target
Name:
Adenosine receptor A1
Synonyms:
AA1R_RAT ADENOSINE A1 high Adenosine A1 receptor (A1) Adenosine receptors A1 | Adora1
Type:
Protein
Mol. Mass.:
36704.13
Organism:
Rattus norvegicus (rat)
Description:
Residue:
326
  
Inhibitor
Name:
BDBM50368180
Synonyms:
CHEMBL2235589 | CHEMBL604764
Type:
Small organic molecule
Emp. Form.:
C21H25N5O4
Mol. Mass.:
411.4543
SMILES:
OC[C@H]1O[C@H]([C@H](O)[C@@H]1O)n1cnc2c(NCC3CCCc4ccccc34)ncnc12
: