Target
D(2) dopamine receptor
Ligand
BDBM50007508
Substrate
Meas. Tech.
ChEMBL_62894 (CHEMBL676133)
Ki
0.024000±n/a nM
Citation
 Högberg, TStröm, Pde Paulis, TStensland, BCsöregh, ILundin, KHall, HOgren, SO Potential antipsychotic agents. 9. Synthesis and stereoselective dopamine D-2 receptor blockade of a potent class of substituted (R)-N-[(1-benzyl-2-pyrrolidinyl)methyl]benzamides. Relations to other side chain congeners. J Med Chem 34:948-55 (1991)  
Target
Name:
D(2) dopamine receptor
Synonyms:
DOPAMINE D2 DOPAMINE D2 Short Dopamine D2 receptor Drd2
Type:
G Protein-Coupled Receptor (GPCR)
Mol. Mass.:
50931.60
Organism:
Rattus norvegicus (rat)
Description:
P61169
Residue:
444
  
Inhibitor
Name:
BDBM50007508
Synonyms:
(R) N-(1-Benzyl-pyrrolidin-2-ylmethyl)-5-bromo-2,3-dimethoxy-benzamide | CHEMBL176458
Type:
Small organic molecule
Emp. Form.:
C21H25BrN2O3
Mol. Mass.:
433.339
SMILES:
COc1cc(Br)cc(C(=O)NC[C@H]2CCCN2Cc2ccccc2)c1OC
: