Target
Sodium-dependent dopamine transporter
Ligand
BDBM50012154
Substrate
Meas. Tech.
ChEMBL_61488 (CHEMBL672390)
IC50
36±n/a nM
Citation
 Milius, RASaha, JKMadras, BKNeumeyer, JL Synthesis and receptor binding of N-substituted tropane derivatives. High-affinity ligands for the cocaine receptor. J Med Chem 34:1728-31 (1991)  
Target
Name:
Sodium-dependent dopamine transporter
Synonyms:
DA transporter SC6A3_RAT Sodium-dependent dopamine transporter | Sodium-dependent dopamine transporter (DAT)
Type:
Multi-pass membrane protein
Mol. Mass.:
68749.45
Organism:
Rattus norvegicus (rat)
Description:
P23977
Residue:
619
  
Inhibitor
Name:
BDBM50012154
Synonyms:
(3S,8R)-3-(4-Fluoro-phenyl)-8-aza-bicyclo[3.2.1]octane-2-carboxylic acid methyl ester CHEMBL21112
Type:
Small organic molecule
Emp. Form.:
C15H18FNO2
Mol. Mass.:
263.3073
SMILES:
COC(=O)C1C2CCC(C[C@@H]1c1ccc(F)cc1)N2
: