Target
Sigma non-opioid intracellular receptor 1
Ligand
BDBM50006973
Substrate
Meas. Tech.
ChEMBL_201291 (CHEMBL805781)
IC50
>10000±n/a nM
Citation
 Glennon, RAIsmaiel, AMSmith, JDYousif, Mel-Ashmawy, MHerndon, JLFischer, JBHowie, KJServer, AC Binding of substituted and conformationally restricted derivatives of N-(3-phenyl-n-propyl)-1-phenyl-2-aminopropane at sigma-receptors. J Med Chem 34:1855-9 (1991)  
Target
Name:
Sigma non-opioid intracellular receptor 1
Synonyms:
Opioid receptor SGMR1_RAT Sigma non-opioid intracellular receptor 1 Sigma-1 | Sigmar1
Type:
Enzyme Catalytic Domain
Mol. Mass.:
25266.54
Organism:
RAT
Description:
Q9R0C9
Residue:
223
  
Inhibitor
Name:
BDBM50006973
Synonyms:
CHEMBL298758 | [2-(3,4-Dichloro-phenyl)-1-methyl-ethyl]-(3-phenyl-propyl)-amine
Type:
Small organic molecule
Emp. Form.:
C18H21Cl2N
Mol. Mass.:
322.272
SMILES:
CC(Cc1ccc(Cl)c(Cl)c1)NCCCc1ccccc1
: