Target
Adenosine deaminase
Ligand
BDBM50368280
Substrate
Meas. Tech.
ChEBML_30795
Ki
6900±n/a nM
Citation
 Cristalli, GVittori, SEleuteri, AGrifantini, MVolpini, RLupidi, GCapolongo, LPesenti, E Purine and 1-deazapurine ribonucleosides and deoxyribonucleosides: synthesis and biological activity. J Med Chem 34:2226-30 (1991)  
Target
Name:
Adenosine deaminase
Synonyms:
ADA Adenosine aminohydrolase
Type:
Enzyme
Mol. Mass.:
40910.44
Organism:
Bos taurus (bovine)
Description:
Residue:
363
  
Inhibitor
Name:
BDBM50368280
Synonyms:
CHEMBL612157
Type:
Small organic molecule
Emp. Form.:
C11H13ClN4O5
Mol. Mass.:
316.698
SMILES:
OC[C@H]1OC([C@H](O)[C@@H]1O)n1cnc2c(NO)cc(Cl)nc12
: