Target
Vasopressin V1a receptor
Ligand
BDBM50008097
Substrate
Meas. Tech.
ChEMBL_214391 (CHEMBL819412)
Kd
0.331±n/a nM
Citation
 Barbeau, DGuay, SNeugebauer, WEscher, E Preparation and biological activities of potential vasopressin photoaffinity labels. J Med Chem 35:151-7 (1992)  
Target
Name:
Vasopressin V1a receptor
Synonyms:
Avpr1a VASOPRESSIN V1A Vasopressin V1a receptor | Vasopressin receptor
Type:
Enzyme Catalytic Domain
Mol. Mass.:
47674.81
Organism:
RAT
Description:
VASOPRESSIN V1A AVPR1A RAT::P30560
Residue:
424
  
Inhibitor
Name:
BDBM50008097
Synonyms:
CHEMBL2028983 | [2-({1-[19-Amino-13-(4-azido-benzyl)-10-(2-carbamoyl-ethyl)-7-carbamoylmethyl-16-(4-hydroxy-benzyl)-6,9,12,15,18-pentaoxo-1,2-dithia-5,8,11,14,17-pentaaza-cycloicosane-4-carbonyl]-pyrrolidine-2-carbonyl}-amino)-5-guanidino-pentanoylamino]-acetic acid
Type:
Small organic molecule
Emp. Form.:
C60H83N19O12S2
Mol. Mass.:
1326.551
SMILES:
[#6]-[#6@H](-[#7](-[#6])-[#6](=O)-[#6@H]-1-[#6]-[#16]-[#16]-[#6]C2([#6]-[#6]-[#6]-[#6]2)[#6](=O)-[#7]-[#6@@H](-[#6]-c2ccc(-[#8])cc2)-[#6](=O)-[#7]-[#6@@H](-[#6]-c2ccccc2)-[#6](=O)-[#7]-[#6@@H](-[#6]-[#6]-[#6](-[#7])=O)-[#6](=O)-[#7]-[#6@@H](-[#6]-[#6](-[#7])=O)-[#6](=O)-[#7]-1)-[#6](=O)-[#7]-[#6@@H](-[#6]-[#6]-[#6]\[#7]=[#6](/[#7])-[#7])-[#6](=O)-[#7]-[#6@@H](-[#6]-[#6]-[#6]-[#6]\[#7]=[#6](\[#7])-c1ccc(cc1)-[#7]=[N+]=[#7-])-[#6](-[#7])=O
: