Target
Renin
Ligand
BDBM50008123
Substrate
Meas. Tech.
ChEBML_192731
IC50
0.900000±n/a nM
Citation
 Doherty, AMSircar, IKornberg, BEQuin, JWinters, RTKaltenbronn, JSTaylor, MDBatley, BLRapundalo, SRRyan, MJ Design and synthesis of potent, selective, and orally active fluorine-containing renin inhibitors. J Med Chem 35:2-14 (1992)  
Target
Name:
Renin
Synonyms:
Angiotensinogenase RENI_HUMAN
Type:
Enzyme
Mol. Mass.:
45058.99
Organism:
Homo sapiens (Human)
Description:
Residue:
406
  
Inhibitor
Name:
BDBM50008123
Synonyms:
5-Cyclohexyl-2,2-difluoro-4-{3-(1H-imidazol-4-yl)-2-[2-(morpholine-4-sulfonylamino)-3-phenyl-propionylamino]-propionylamino}-3-oxo-pentanoic acid (2-morpholin-4-yl-ethyl)-amide; Hydrate | CHEMBL262107
Type:
Small organic molecule
Emp. Form.:
C36H52F2N8O8S
Mol. Mass.:
794.909
SMILES:
FC(F)(C(=O)NCCN1CCOCC1)C(=O)[C@H](CC1CCCCC1)NC(=O)[C@H](Cc1cnc[nH]1)NC(=O)[C@H](Cc1ccccc1)NS(=O)(=O)N1CCOCC1
: