Target
Cholecystokinin receptor type A
Ligand
BDBM50024321
Substrate
Meas. Tech.
ChEBML_49401
IC50
600±n/a nM
Citation
 Drysdale, MJPritchard, MCHorwell, DC Rationally designed"dipeptoid" analogues of CCK. Acid mimics of the potent and selective non-peptide CCK-B receptor antagonist CI-988. J Med Chem 35:2573-81 (1992)  
Target
Name:
Cholecystokinin receptor type A
Synonyms:
CCKAR_RAT Cholecystokinin peripheral Cholecystokinin receptor type A
Type:
Enzyme Catalytic Domain
Mol. Mass.:
49676.37
Organism:
RAT
Description:
Cholecystokinin central 0 RAT::P30551
Residue:
444
  
Inhibitor
Name:
BDBM50024321
Synonyms:
3-{2-[2-(3-tert-Butoxycarbonylamino-propionylamino)-3-(1H-indol-3-yl)-propionylamino]-4-methylsulfanyl-butyrylamino}-N-(1-carbamoyl-2-phenyl-ethyl)-succinamic acid CHEMBL1328 PENTAGASTRIN | Peptavlon
Type:
Small organic molecule
Emp. Form.:
C37H49N7O9S
Mol. Mass.:
767.891
SMILES:
CSCC[C@H](NC(=O)[C@H](Cc1c[nH]c2ccccc12)NC(=O)CCNC(=O)OC(C)(C)C)C(=O)N[C@@H](CC(O)=O)C(=O)N[C@@H](Cc1ccccc1)C(N)=O
: