Target
Neuropeptide Y receptor type 1
Ligand
BDBM50003054
Substrate
Meas. Tech.
ChEBML_143821
Kd
>1000±n/a nM
Citation
 Reymond, MTDelmas, LKoerber, SCBrown, MRRivier, JE Truncated, branched, and/or cyclic analogues of neuropeptide Y: importance of the pancreatic peptide fold in the design of specific Y2 receptor ligands. J Med Chem 35:3653-9 (1992)  
Target
Name:
Neuropeptide Y receptor type 1
Synonyms:
NPY-Y1 NPY1R NPYR neuropeptide Y receptor Y1
Type:
Enzyme Catalytic Domain
Mol. Mass.:
44399.07
Organism:
Homo sapiens (Human)
Description:
NPY-Y1 NPY1R HUMAN::P25929
Residue:
384
  
Inhibitor
Name:
BDBM50003054
Synonyms:
CHEMBL406025 | c(30,34)-Ala-Arg-Tyr-Tyr-Ser-Ala-Leu-Arg-His-Tyr-Ile-Asn-Lys-Ile-Thr-Arg-Glu-Arg-Tyr
Type:
Small organic molecule
Emp. Form.:
C111H169N35O28
Mol. Mass.:
2441.7473
SMILES:
CC[C@H](C)[C@H](NC(=O)[C@H](Cc1ccc(O)cc1)NC(=O)[C@H](Cc1cnc[nH]1)NC(=O)[C@H](CCNC(N)=N)NC(=O)[C@H](CC(C)C)NC(=O)[C@H](C)NC(=O)[C@H](CO)NC(=O)[C@H](Cc1ccc(O)cc1)NC(=O)[C@H](Cc1ccc(O)cc1)NC(=O)[C@H](CCCNC(N)=N)NC(=O)[C@H](C)N)C(=O)N[C@@H](CC(N)=O)C(=O)N[C@@H]1CCCCNC(=O)CC[C@H](NC(=O)[C@H](CCCNC(N)=N)NC(=O)[C@H](NC(=O)[C@@H](NC1=O)[C@@H](C)CC)[C@@H](C)O)C(=O)N[C@@H](CCCNC(N)=N)C(=O)N[C@@H](Cc1ccc(O)cc1)C(O)=O
: