Target
Thymidylate synthase
Ligand
BDBM18796
Substrate
Meas. Tech.
ChEBML_209975
Ki
340±n/a nM
Citation
 Taylor, ECKuhnt, DShih, CRinzel, SMGrindey, GBBarredo, JJannatipour, MMoran, RG A dideazatetrahydrofolate analogue lacking a chiral center at C-6, N-[4-[2-(2-amino-3,4-dihydro-4-oxo-7H-pyrrolo[2,3-d]pyrimidin-5- yl)ethyl]benzoyl]-L-glutamic acid, is an inhibitor of thymidylate synthase. J Med Chem 35:4450-4 (1992)  
Target
Name:
Thymidylate synthase
Synonyms:
TS TYSY_MOUSE | Tyms
Type:
PROTEIN
Mol. Mass.:
34957.15
Organism:
Mus musculus
Description:
ChEMBL_1340097
Residue:
307
  
Inhibitor
Name:
BDBM18796
Synonyms:
(2S)-2-{[4-(2-{2-amino-4-oxo-1H,4H,7H-pyrrolo[2,3-d]pyrimidin-5-yl}ethyl)phenyl]formamido}pentanedioic acid Pemetrexed
Type:
Small organic molecule
Emp. Form.:
C20H21N5O6
Mol. Mass.:
427.4106
SMILES:
Nc1nc2[nH]cc(CCc3ccc(cc3)C(=O)N[C@@H](CCC(O)=O)C(O)=O)c2c(=O)[nH]1
: