Target
Adenosine receptor A1
Ligand
BDBM50003018
Substrate
Meas. Tech.
ChEBML_29305
Ki
11±n/a nM
Citation
 Jacobson, KAvan Galen, PJWilliams, M Adenosine receptors: pharmacology, structure-activity relationships, and therapeutic potential. J Med Chem 35:407-22 (1992)  
Target
Name:
Adenosine receptor A1
Synonyms:
AA1R_RAT ADENOSINE A1 high Adenosine A1 receptor (A1) Adenosine receptors A1 | Adora1
Type:
Protein
Mol. Mass.:
36704.13
Organism:
Rattus norvegicus (rat)
Description:
Residue:
326
  
Inhibitor
Name:
BDBM50003018
Synonyms:
8-(3-Oxo-cyclopentyl)-1,3-dipropyl-3,7-dihydro-purine-2,6-dione | CHEMBL84545
Type:
Small organic molecule
Emp. Form.:
C16H22N4O3
Mol. Mass.:
318.3709
SMILES:
CCCn1c2nc([nH]c2c(=O)n(CCC)c1=O)C1CCC(=O)C1
: