Target
Aminopeptidase N
Ligand
BDBM50001947
Substrate
Meas. Tech.
ChEBML_35366
IC50
91200±n/a nM
Citation
 Herranz, RVinuesa, SPérez, CGarcía-López, MTLópez, Ede Ceballos, MLDel Río, J Analgesic dipeptide derivatives. 7. 3,7-Diamino-2-hydroxyheptanoic acid (DAHHA) containing dipeptide analogues of the analgesic compound H-Lys-Trp(Nps)-OMe. J Med Chem 35:889-95 (1992)  
Target
Name:
Aminopeptidase N
Synonyms:
AMPN_RAT | Anpep
Type:
PROTEIN
Mol. Mass.:
109431.53
Organism:
Rattus norvegicus
Description:
ChEMBL_35366
Residue:
965
  
Inhibitor
Name:
BDBM50001947
Synonyms:
2-(3,7-Diamino-2-hydroxy-heptanoylamino)-3-[2-(2-nitro-phenylsulfanyl)-1H-indol-3-yl]-propionic acid methyl ester2-(3,7-diamino-2-hydroxy-heptanoylamino)-3-[2-(2-nitro-phenylsulfanyl)-1H-indol-3-yl]-propionic acid methyl ester; | CHEMBL171497
Type:
Small organic molecule
Emp. Form.:
C25H31N5O6S
Mol. Mass.:
529.609
SMILES:
COC(=O)[C@@H](Cc1c(Sc2ccccc2[N+]([O-])=O)[nH]c2ccccc12)NC(=O)C(O)[C@H](N)CCCCN
: