Target
Aminopeptidase B
Ligand
BDBM50368570
Substrate
Meas. Tech.
ChEMBL_35347 (CHEMBL647930)
IC50
>1000000±n/a nM
Citation
 Herranz, RVinuesa, SPérez, CGarcía-López, MTLópez, Ede Ceballos, MLDel Río, J Analgesic dipeptide derivatives. 7. 3,7-Diamino-2-hydroxyheptanoic acid (DAHHA) containing dipeptide analogues of the analgesic compound H-Lys-Trp(Nps)-OMe. J Med Chem 35:889-95 (1992)  
Target
Name:
Aminopeptidase B
Synonyms:
AMPB_RAT Arginine aminopeptidase Cytosol aminopeptidase IV | Rnpep
Type:
PROTEIN
Mol. Mass.:
72609.93
Organism:
Rattus norvegicus
Description:
ChEMBL_1344423
Residue:
650
  
Inhibitor
Name:
BDBM50368570
Synonyms:
CHEMBL1794908
Type:
Small organic molecule
Emp. Form.:
C19H28N4O4
Mol. Mass.:
376.45
SMILES:
COC(=O)[C@@H](Cc1c[nH]c2ccccc12)NC(=O)[C@H](O)[C@H](N)CCCCN
: