Target
Beta-1/Beta-2/Beta-3 adrenergic receptor
Ligand
BDBM50005834
Substrate
Meas. Tech.
ChEMBL_38890 (CHEMBL651237)
Ki
>10000±n/a nM
Citation
 Flynn, DLZabrowski, DLBecker, DPNosal, RVillamil, CIGullikson, GWMoummi, CYang, DC SC-53116: the first selective agonist at the newly identified serotonin 5-HT4 receptor subtype. J Med Chem 35:1486-9 (1992)  
Target
Name:
Beta-1/Beta-2/Beta-3 adrenergic receptor
Synonyms:
Adrenergic receptor beta
Type:
Mol. Mass.:
Description:
ASSAY_ID of ChEMBL is 1340543
Components:
This complex has 3 components.
Component 1
Name:
Beta-1 adrenergic receptor
Synonyms:
ADRB1R, B1AR Adrb1 Adrenergic receptor beta Beta-1 adrenoreceptor adrenergic Beta1,2
Type:
Protein
Mol. Mass.:
50486.84
Organism:
Rattus norvegicus (Rat)
Description:
P18090
Residue:
466
  
Component 2
Name:
Beta-2 adrenergic receptor
Synonyms:
ADRB2_RAT Adrb2r | Adrenergic receptor beta
Type:
PROTEIN
Mol. Mass.:
46896.26
Organism:
Rattus norvegicus
Description:
ChEMBL_38603
Residue:
418
  
Component 3
Name:
Beta-3 adrenergic receptor
Synonyms:
ADRB3_RAT Adrb3r Beta-3 adrenergic receptor
Type:
PROTEIN
Mol. Mass.:
43161.83
Organism:
Rattus norvegicus
Description:
ChEMBL_1509452
Residue:
400
  
Inhibitor
Name:
BDBM50005834
Synonyms:
1-Isopropyl-3-[2-(8-methyl-8-aza-bicyclo[3.2.1]oct-3-yl)-acetyl]-1,3-dihydro-benzoimidazol-2-one | CHEMBL38041
Type:
Small organic molecule
Emp. Form.:
C20H27N3O2
Mol. Mass.:
341.4473
SMILES:
CC(C)n1c2ccccc2n(C(=O)CC2CC3CCC(C2)N3C)c1=O
: