Target
Endothelin receptor type B
Ligand
BDBM50329850
Substrate
Meas. Tech.
ChEBML_63876
IC50
23000±n/a nM
Citation
 Doherty, AM Endothelin: a new challenge. J Med Chem 35:1493-508 (1992)  
Target
Name:
Endothelin receptor type B
Synonyms:
EDNRB Endothelin receptor ET-B
Type:
PROTEIN
Mol. Mass.:
49616.89
Organism:
Sus scrofa
Description:
ChEMBL_63872
Residue:
443
  
Inhibitor
Name:
BDBM50329850
Synonyms:
(R)-3-Amino-4-[(S)-2-((R)-1-{(S)-1-[(R)-1-(1H-indol-3-ylmethyl)-2-oxo-ethylcarbamoyl]-3-methyl-but-3-enylcarbamoyl}-2-methyl-propylcarbamoyl)-pyrrolidin-1-yl]-4-oxo-butyric acid CHEMBL1269102 [(5R,8R,11S,14R,16aR)-8-(1H-Indol-3-ylmethyl)-11-isobutyl-14-isopropyl-4,7,10,13,16-pentaoxo-hexadecahydro-3a,6,9,12,15-pentaaza-cyclopentacyclopentadecen-5-yl]-acetic acid [8-(1H-Indol-3-ylmethyl)-11-isobutyl-14-isopropyl-4,7,10,13,16-pentaoxo-hexadecahydro-3a,6,9,12,15-pentaaza-cyclopentacyclopentadecen-5-yl]-acetic acid
Type:
Small organic molecule
Emp. Form.:
C31H42N6O7
Mol. Mass.:
610.7012
SMILES:
CC(C)C[C@@H]1NC(=O)[C@H](NC(=O)[C@@H]2CCCN2C(=O)[C@H](CC(O)=O)NC(=O)[C@@H](Cc2c[nH]c3ccccc23)NC1=O)C(C)C
: