Target
Acyl-CoA:cholesterol acyltransferase
Ligand
BDBM50005957
Substrate
Meas. Tech.
ChEBML_28339
IC50
65±n/a nM
Citation
 Roth, BDBlankley, CJHoefle, MLHolmes, ARoark, WHTrivedi, BKEssenburg, ADKieft, KAKrause, BRStanfield, RL Inhibitors of acyl-CoA:cholesterol acyltransferase. 1. Identification and structure-activity relationships of a novel series of fatty acid anilide hypocholesterolemic agents. J Med Chem 35:1609-17 (1992)  
Target
Name:
Acyl-CoA:cholesterol acyltransferase
Synonyms:
ACAT
Type:
Mol. Mass.:
35405.31
Organism:
Oryctolagus cuniculus
Description:
Residue:
305
  
Inhibitor
Name:
BDBM50005957
Synonyms:
CHEMBL44460 | Pentadecanoic acid (2,4,6-trimethoxy-phenyl)-amide
Type:
Small organic molecule
Emp. Form.:
C24H41NO4
Mol. Mass.:
407.5866
SMILES:
CCCCCCCCCCCCCCC(=O)Nc1c(OC)cc(OC)cc1OC
: