Target
Platelet-activating factor receptor
Ligand
BDBM50006087
Substrate
Meas. Tech.
ChEBML_221704
IC50
14900±n/a nM
Citation
 Wissner, ACarroll, MLGreen, KEKerwar, SSPickett, WCSchaub, RETorley, LWWrenn, SKohler, CA Analogues of platelet activating factor. 6. Mono- and bis-aryl phosphate antagonists of platelet activating factor. J Med Chem 35:1650-62 (1992)  
Target
Name:
Platelet-activating factor receptor
Synonyms:
PAF-R PTAFR_CAVPO Platelet-activating factor receptor
Type:
Protein
Mol. Mass.:
39005.63
Organism:
Cavia porcellus
Description:
Residue:
342
  
Inhibitor
Name:
BDBM50006087
Synonyms:
3-(3-{[3-(4-Benzyloxy-phenoxy)-2-methoxy-propoxy]-hydroxy-phosphoryloxy}-benzyl)-thiazol-3-ium | CHEMBL42725
Type:
Small organic molecule
Emp. Form.:
C27H28NO7PS
Mol. Mass.:
541.552
SMILES:
COC(COc1ccc(OCc2ccccc2)cc1)COP([O-])(=O)Oc1cccc(C[n+]2ccsc2)c1
: