Target
D(2) dopamine receptor
Ligand
BDBM50047145
Substrate
Meas. Tech.
ChEBML_59890
Ki
0.600000±n/a nM
Citation
 Chidester, CGLin, CHLahti, RAHaadsma-Svensson, SRSmith, MW Comparison of 5-HT1A and dopamine D2 pharmacophores. X-ray structures and affinities of conformationally constrained ligands. J Med Chem 36:1301-15 (1993)  
Target
Name:
D(2) dopamine receptor
Synonyms:
D(2) dopamine receptor DOPAMINE D2 Long DRD2 Dopamine D2 receptor Dopamine D2 receptor (D2R) Dopamine2-like | d2
Type:
Cell-surface receptors
Mol. Mass.:
50647.10
Organism:
Homo sapiens (Human)
Description:
P14416
Residue:
443
  
Inhibitor
Name:
BDBM50047145
Synonyms:
(Recemic)5-Dipropylamino-5,6-dihydro-1H,4H-imidazo[4,5,1-ij]quinoline-2-thione | CHEMBL281248
Type:
Small organic molecule
Emp. Form.:
C16H23N3S
Mol. Mass.:
289.439
SMILES:
CCCN(CCC)[C@@H]1Cc2cccc3[nH]c(=S)n(C1)c23
: