Target
Angiotensin-converting enzyme
Ligand
BDBM50044232
Substrate
Meas. Tech.
ChEBML_36748
IC50
50000±n/a nM
Citation
 Patchett, AA Excursions in drug discovery. J Med Chem 36:2051-8 (1993)  
Target
Name:
Angiotensin-converting enzyme
Synonyms:
ACE Angiotensin converting enzyme (ACE) Angiotensin-converting enzyme, soluble form CD_antigen=CD143 DCP1 Kininase II
Type:
Enzyme
Mol. Mass.:
149709.01
Organism:
Homo sapiens (Human)
Description:
Residue:
1306
  
Inhibitor
Name:
BDBM50044232
Synonyms:
1-(3-Hydroxycarbamoyl-propionyl)-pyrrolidine-2-carboxylic acid | CHEMBL291381
Type:
Small organic molecule
Emp. Form.:
C9H14N2O5
Mol. Mass.:
230.2179
SMILES:
ONC(=O)CCC(=O)N1CCCC1C(O)=O
: