Target
5-hydroxytryptamine receptor 1A
Ligand
BDBM50041952
Substrate
Meas. Tech.
ChEMBL_1138 (CHEMBL616083)
Ki
13±n/a nM
Citation
 Zhuang, ZPKung, MPKung, HF Synthesis of (R,S)-trans-8-hydroxy-2-[N-n-propyl-N-(3'-iodo-2'-propenyl)amino]tetral in (trans-8-OH-PIPAT): a new 5-HT1A receptor ligand. J Med Chem 36:3161-5 (1993)  
Target
Name:
5-hydroxytryptamine receptor 1A
Synonyms:
5-HT-1A 5-HT1A 5-hydroxytryptamine receptor 1A (5HT1A) 5ht1a Htr1a Serotonin 1a (5-HT1a) receptor/Adrenergic receptor alpha-1 | Serotonin receptor 1A
Type:
G Protein-Coupled Receptor (GPCR)
Mol. Mass.:
46445.29
Organism:
Rattus norvegicus (rat)
Description:
Binding assays were performed using rat hippocampal membranes.
Residue:
422
  
Inhibitor
Name:
BDBM50041952
Synonyms:
(R,S) (3-Iodo-allyl)-(8-methoxy-1,2,3,4-tetrahydro-naphthalen-2-yl)-propyl-amine | CHEMBL108324
Type:
Small organic molecule
Emp. Form.:
C17H24INO
Mol. Mass.:
385.283
SMILES:
CCCN(C\C=C\I)C1CCc2cccc(OC)c2C1
: