Target
D(2) dopamine receptor
Ligand
BDBM50368723
Substrate
Meas. Tech.
ChEBML_52741
Ki
28±n/a nM
Citation
 Kawakubo, HTakagi, SYamaura, YKatoh, SIshimoto, YNagatani, TMochizuki, DKamata, TSasaki, Y (R)-1,2,3,4-tetrahydro[1]benzothieno[2,3-c]pyridines: novel optically active compounds with strong 5-HT1A receptor binding ability exhibiting anticonflict activity and lessening of memory impairment. J Med Chem 36:3526-32 (1994)  
Target
Name:
D(2) dopamine receptor
Synonyms:
D(2) dopamine receptor DOPAMINE D2 Long DRD2 Dopamine D2 receptor Dopamine D2 receptor (D2R) Dopamine2-like | d2
Type:
Cell-surface receptors
Mol. Mass.:
50647.10
Organism:
Homo sapiens (Human)
Description:
P14416
Residue:
443
  
Inhibitor
Name:
BDBM50368723
Synonyms:
Metanopirone TANDOSPIRONE HYDROCHLORIDE | Tandospirone
Type:
Small organic molecule
Emp. Form.:
C21H29N5O2
Mol. Mass.:
383.4873
SMILES:
O=C1[C@H]2[C@@H]3CC[C@@H](C3)[C@H]2C(=O)N1CCCCN1CCN(CC1)c1ncccn1
: