Target
Neprilysin
Ligand
BDBM50042827
Substrate
Meas. Tech.
ChEMBL_144597 (CHEMBL747372)
IC50
3±n/a nM
Citation
 MacPherson, LJBayburt, EKCapparelli, MPBohacek, RSClarke, FHGhai, RDSakane, YBerry, CJPeppard, JVTrapani, AJ Design and synthesis of an orally active macrocyclic neutral endopeptidase 24.11 inhibitor. J Med Chem 36:3821-8 (1994)  
Target
Name:
Neprilysin
Synonyms:
Mme Neprilysin Neutral endopeptidase 24.11
Type:
Protein
Mol. Mass.:
85789.59
Organism:
Rattus norvegicus (Rat)
Description:
P07861
Residue:
750
  
Inhibitor
Name:
BDBM50042827
Synonyms:
9-Mercaptomethyl-10-oxo-azecane-2-carboxylic acid | CHEMBL333720
Type:
Small organic molecule
Emp. Form.:
C11H19NO3S
Mol. Mass.:
245.338
SMILES:
OC(=O)C1CCCCCCC(CS)C(=O)N1
: