Target
Gastrin/cholecystokinin type B receptor
Ligand
BDBM50063629
Substrate
Meas. Tech.
ChEMBL_47960 (CHEMBL656248)
IC50
8±n/a nM
Citation
 Bock, MGDiPardo, RMEvans, BERittle, KEWhitter, WLGarsky, VMGilbert, KFLeighton, JLCarson, KLMellin, EC Development of 1,4-benzodiazepine cholecystokinin type B antagonists. J Med Chem 36:4276-92 (1994)  
Target
Name:
Gastrin/cholecystokinin type B receptor
Synonyms:
CCK-2 receptor CCK-BR CCKRB Cholecystokinin receptor GASR_HUMAN | Gastrin/cholecystokinin type B receptor
Type:
G Protein-Coupled Receptor (GPCR)
Mol. Mass.:
48445.79
Organism:
Homo sapiens (Human)
Description:
Stable expression of human CCK-2 receptors in HEK 293 cells.
Residue:
447
  
Inhibitor
Name:
BDBM50063629
Synonyms:
3-[3-((R)-1-Methyl-2-oxo-5-phenyl-2,3-dihydro-1H-benzo[e][1,4]diazepin-3-yl)-ureido]-benzoic acid methyl ester | CHEMBL9449
Type:
Small organic molecule
Emp. Form.:
C25H22N4O4
Mol. Mass.:
442.4666
SMILES:
COC(=O)c1cccc(NC(=O)N[C@@H]2N=C(c3ccccc3)c3ccccc3N(C)C2=O)c1
: