Target
Cholecystokinin receptor type A
Ligand
BDBM50456295
Substrate
Meas. Tech.
ChEMBL_50185 (CHEMBL662400)
IC50
0.260000±n/a nM
Citation
 Bock, MGDiPardo, RMEvans, BERittle, KEWhitter, WLGarsky, VMGilbert, KFLeighton, JLCarson, KLMellin, EC Development of 1,4-benzodiazepine cholecystokinin type B antagonists. J Med Chem 36:4276-92 (1994)  
Target
Name:
Cholecystokinin receptor type A
Synonyms:
CCKAR_RAT Cholecystokinin peripheral Cholecystokinin receptor type A
Type:
Enzyme Catalytic Domain
Mol. Mass.:
49676.37
Organism:
RAT
Description:
Cholecystokinin central 0 RAT::P30551
Residue:
444
  
Inhibitor
Name:
BDBM50456295
Synonyms:
CHEMBL2111920
Type:
Small organic molecule
Emp. Form.:
C23H19ClN4O2
Mol. Mass.:
418.876
SMILES:
CN1c2ccccc2C(=N[C@H](NC(=O)Nc2ccccc2Cl)C1=O)c1ccccc1
: