Target
Gastrin/cholecystokinin type B receptor
Ligand
BDBM50456298
Substrate
Meas. Tech.
ChEMBL_47960 (CHEMBL656248)
IC50
1.4±n/a nM
Citation
 Bock, MGDiPardo, RMEvans, BERittle, KEWhitter, WLGarsky, VMGilbert, KFLeighton, JLCarson, KLMellin, EC Development of 1,4-benzodiazepine cholecystokinin type B antagonists. J Med Chem 36:4276-92 (1994)  
Target
Name:
Gastrin/cholecystokinin type B receptor
Synonyms:
CCK-2 receptor CCK-BR CCKRB Cholecystokinin receptor GASR_HUMAN | Gastrin/cholecystokinin type B receptor
Type:
G Protein-Coupled Receptor (GPCR)
Mol. Mass.:
48445.79
Organism:
Homo sapiens (Human)
Description:
Stable expression of human CCK-2 receptors in HEK 293 cells.
Residue:
447
  
Inhibitor
Name:
BDBM50456298
Synonyms:
CHEMBL2092976
Type:
Small organic molecule
Emp. Form.:
C28H26ClN5O3
Mol. Mass.:
515.991
SMILES:
Clc1ccc(NC(=O)N[C@@H]2N=C(c3ccccc3)c3ccccc3N(CC(=O)N3CCCC3)C2=O)cc1
: