Target
Gastrin/cholecystokinin type B receptor
Ligand
BDBM50456296
Substrate
Meas. Tech.
ChEMBL_47960 (CHEMBL656248)
IC50
3.8±n/a nM
Citation
 Bock, MGDiPardo, RMEvans, BERittle, KEWhitter, WLGarsky, VMGilbert, KFLeighton, JLCarson, KLMellin, EC Development of 1,4-benzodiazepine cholecystokinin type B antagonists. J Med Chem 36:4276-92 (1994)  
Target
Name:
Gastrin/cholecystokinin type B receptor
Synonyms:
CCK-2 receptor CCK-BR CCKRB Cholecystokinin receptor GASR_HUMAN | Gastrin/cholecystokinin type B receptor
Type:
G Protein-Coupled Receptor (GPCR)
Mol. Mass.:
48445.79
Organism:
Homo sapiens (Human)
Description:
Stable expression of human CCK-2 receptors in HEK 293 cells.
Residue:
447
  
Inhibitor
Name:
BDBM50456296
Synonyms:
CHEMBL2111923
Type:
Small organic molecule
Emp. Form.:
C23H19BrN4O2
Mol. Mass.:
463.327
SMILES:
CN1c2ccccc2C(=N[C@@H](NC(=O)Nc2cccc(Br)c2)C1=O)c1ccccc1
: