Target
Cholecystokinin receptor type A
Ligand
BDBM50043534
Substrate
Meas. Tech.
ChEMBL_50185 (CHEMBL662400)
IC50
8.3±n/a nM
Citation
 Bock, MGDiPardo, RMEvans, BERittle, KEWhitter, WLGarsky, VMGilbert, KFLeighton, JLCarson, KLMellin, EC Development of 1,4-benzodiazepine cholecystokinin type B antagonists. J Med Chem 36:4276-92 (1994)  
Target
Name:
Cholecystokinin receptor type A
Synonyms:
CCKAR_RAT Cholecystokinin peripheral Cholecystokinin receptor type A
Type:
Enzyme Catalytic Domain
Mol. Mass.:
49676.37
Organism:
RAT
Description:
Cholecystokinin central 0 RAT::P30551
Residue:
444
  
Inhibitor
Name:
BDBM50043534
Synonyms:
1-(1-Methyl-2-oxo-5-phenyl-2,3-dihydro-1H-benzo[e][1,4]diazepin-3-yl)-3-phenyl-urea | CHEMBL136408
Type:
Small organic molecule
Emp. Form.:
C23H20N4O2
Mol. Mass.:
384.4305
SMILES:
CN1c2ccccc2C(=NC(NC(=O)Nc2ccccc2)C1=O)c1ccccc1
: