Target
Cholecystokinin receptor type A
Ligand
BDBM50043508
Substrate
Meas. Tech.
ChEMBL_50185 (CHEMBL662400)
IC50
10±n/a nM
Citation
 Bock, MGDiPardo, RMEvans, BERittle, KEWhitter, WLGarsky, VMGilbert, KFLeighton, JLCarson, KLMellin, EC Development of 1,4-benzodiazepine cholecystokinin type B antagonists. J Med Chem 36:4276-92 (1994)  
Target
Name:
Cholecystokinin receptor type A
Synonyms:
CCKAR_RAT Cholecystokinin peripheral Cholecystokinin receptor type A
Type:
Enzyme Catalytic Domain
Mol. Mass.:
49676.37
Organism:
RAT
Description:
Cholecystokinin central 0 RAT::P30551
Residue:
444
  
Inhibitor
Name:
BDBM50043508
Synonyms:
1-(3-Fluoro-phenyl)-3-(1-methyl-2-oxo-5-phenyl-2,3-dihydro-1H-benzo[e][1,4]diazepin-3-yl)-urea | CHEMBL335666
Type:
Small organic molecule
Emp. Form.:
C23H19FN4O2
Mol. Mass.:
402.421
SMILES:
CN1c2ccccc2C(=NC(NC(=O)Nc2cccc(F)c2)C1=O)c1ccccc1
: