Target
Gastrin/cholecystokinin type B receptor
Ligand
BDBM50043568
Substrate
Meas. Tech.
ChEMBL_47960 (CHEMBL656248)
IC50
4.4±n/a nM
Citation
 Bock, MGDiPardo, RMEvans, BERittle, KEWhitter, WLGarsky, VMGilbert, KFLeighton, JLCarson, KLMellin, EC Development of 1,4-benzodiazepine cholecystokinin type B antagonists. J Med Chem 36:4276-92 (1994)  
Target
Name:
Gastrin/cholecystokinin type B receptor
Synonyms:
CCK-2 receptor CCK-BR CCKRB Cholecystokinin receptor GASR_HUMAN | Gastrin/cholecystokinin type B receptor
Type:
G Protein-Coupled Receptor (GPCR)
Mol. Mass.:
48445.79
Organism:
Homo sapiens (Human)
Description:
Stable expression of human CCK-2 receptors in HEK 293 cells.
Residue:
447
  
Inhibitor
Name:
BDBM50043568
Synonyms:
1-(3-Methoxy-phenyl)-3-{1-[2-(4-methyl-piperazin-1-yl)-2-oxo-ethyl]-2-oxo-5-phenyl-2,3-dihydro-1H-benzo[e][1,4]diazepin-3-yl}-urea | CHEMBL135371
Type:
Small organic molecule
Emp. Form.:
C30H32N6O4
Mol. Mass.:
540.6129
SMILES:
COc1cccc(NC(=O)NC2N=C(c3ccccc3)c3ccccc3N(CC(=O)N3CCN(C)CC3)C2=O)c1
: