Target
Gastrin/cholecystokinin type B receptor
Ligand
BDBM50043548
Substrate
Meas. Tech.
ChEMBL_47960 (CHEMBL656248)
IC50
0.80±n/a nM
Citation
 Bock, MGDiPardo, RMEvans, BERittle, KEWhitter, WLGarsky, VMGilbert, KFLeighton, JLCarson, KLMellin, EC Development of 1,4-benzodiazepine cholecystokinin type B antagonists. J Med Chem 36:4276-92 (1994)  
Target
Name:
Gastrin/cholecystokinin type B receptor
Synonyms:
CCK-2 receptor CCK-BR CCKRB Cholecystokinin receptor GASR_HUMAN | Gastrin/cholecystokinin type B receptor
Type:
G Protein-Coupled Receptor (GPCR)
Mol. Mass.:
48445.79
Organism:
Homo sapiens (Human)
Description:
Stable expression of human CCK-2 receptors in HEK 293 cells.
Residue:
447
  
Inhibitor
Name:
BDBM50043548
Synonyms:
1-(4-Chloro-phenyl)-3-{1-[2-(4-methyl-piperazin-1-yl)-2-oxo-ethyl]-2-oxo-5-phenyl-2,3-dihydro-1H-benzo[e][1,4]diazepin-3-yl}-urea | CHEMBL342640
Type:
Small organic molecule
Emp. Form.:
C29H29ClN6O3
Mol. Mass.:
545.032
SMILES:
CN1CCN(CC1)C(=O)CN1c2ccccc2C(=NC(NC(=O)Nc2ccc(Cl)cc2)C1=O)c1ccccc1
: