Target
Gastrin/cholecystokinin type B receptor
Ligand
BDBM50043557
Substrate
Meas. Tech.
ChEMBL_47960 (CHEMBL656248)
IC50
7.2±n/a nM
Citation
 Bock, MGDiPardo, RMEvans, BERittle, KEWhitter, WLGarsky, VMGilbert, KFLeighton, JLCarson, KLMellin, EC Development of 1,4-benzodiazepine cholecystokinin type B antagonists. J Med Chem 36:4276-92 (1994)  
Target
Name:
Gastrin/cholecystokinin type B receptor
Synonyms:
CCK-2 receptor CCK-BR CCKRB Cholecystokinin receptor GASR_HUMAN | Gastrin/cholecystokinin type B receptor
Type:
G Protein-Coupled Receptor (GPCR)
Mol. Mass.:
48445.79
Organism:
Homo sapiens (Human)
Description:
Stable expression of human CCK-2 receptors in HEK 293 cells.
Residue:
447
  
Inhibitor
Name:
BDBM50043557
Synonyms:
CHEMBL132875 | Succinic acid mono-{2-[2-oxo-5-phenyl-3-(3-m-tolyl-ureido)-2,3-dihydro-benzo[e][1,4]diazepin-1-yl]-ethyl} ester
Type:
Small organic molecule
Emp. Form.:
C29H28N4O6
Mol. Mass.:
528.5558
SMILES:
Cc1cccc(NC(=O)NC2N=C(c3ccccc3)c3ccccc3N(CCOC(=O)CCC(O)=O)C2=O)c1
: