Target
Gastrin/cholecystokinin type B receptor
Ligand
BDBM50043571
Substrate
Meas. Tech.
ChEMBL_47960 (CHEMBL656248)
IC50
9.7±n/a nM
Citation
 Bock, MGDiPardo, RMEvans, BERittle, KEWhitter, WLGarsky, VMGilbert, KFLeighton, JLCarson, KLMellin, EC Development of 1,4-benzodiazepine cholecystokinin type B antagonists. J Med Chem 36:4276-92 (1994)  
Target
Name:
Gastrin/cholecystokinin type B receptor
Synonyms:
CCK-2 receptor CCK-BR CCKRB Cholecystokinin receptor GASR_HUMAN | Gastrin/cholecystokinin type B receptor
Type:
G Protein-Coupled Receptor (GPCR)
Mol. Mass.:
48445.79
Organism:
Homo sapiens (Human)
Description:
Stable expression of human CCK-2 receptors in HEK 293 cells.
Residue:
447
  
Inhibitor
Name:
BDBM50043571
Synonyms:
1-[1-(5-Methyl-4H-[1,2,4]triazol-3-ylmethyl)-2-oxo-5-phenyl-2,3-dihydro-1H-benzo[e][1,4]diazepin-3-yl]-3-m-tolyl-urea | CHEMBL136975
Type:
Small organic molecule
Emp. Form.:
C27H25N7O2
Mol. Mass.:
479.5331
SMILES:
Cc1nnc(CN2c3ccccc3C(=NC(NC(=O)Nc3cccc(C)c3)C2=O)c2ccccc2)[nH]1
: