Target
Multidrug transporter MdfA
Ligand
BDBM50046501
Substrate
Meas. Tech.
ChEMBL_68323 (CHEMBL680694)
IC50
1400±n/a nM
Citation
 Nelson, MLPark, BHAndrews, JSGeorgian, VAThomas, RCLevy, SB Inhibition of the tetracycline efflux antiport protein by 13-thio-substituted 5-hydroxy-6-deoxytetracyclines. J Med Chem 36:370-7 (1993)  
Target
Name:
Multidrug transporter MdfA
Synonyms:
Chloramphenicol resistance pump cmr Multidrug translocase mdfA cmr | mdfA
Type:
PROTEIN
Mol. Mass.:
44327.48
Organism:
Escherichia coli (strain K12)
Description:
ChEMBL_68323
Residue:
410
  
Inhibitor
Name:
BDBM50046501
Synonyms:
6-Benzylsulfanylmethyl-4-dimethylamino-3,5,10,12,12a-pentahydroxy-1,11-dioxo-1,4,4a,5,5a,6,11,12a-octahydro-naphthacene-2-carboxylic acid amide | CHEMBL332525
Type:
Small organic molecule
Emp. Form.:
C29H30N2O8S
Mol. Mass.:
566.622
SMILES:
CN(C)[C@H]1C2[C@@H](O)C3[C@@H](CSCc4ccccc4)c4cccc(O)c4C(=O)C3C(=O)[C@]2(O)C(=O)C(C(N)=O)C1=O
: