Target
Multidrug transporter MdfA
Ligand
BDBM50368781
Substrate
Meas. Tech.
ChEMBL_68323 (CHEMBL680694)
IC50
13200±n/a nM
Citation
 Nelson, MLPark, BHAndrews, JSGeorgian, VAThomas, RCLevy, SB Inhibition of the tetracycline efflux antiport protein by 13-thio-substituted 5-hydroxy-6-deoxytetracyclines. J Med Chem 36:370-7 (1993)  
Target
Name:
Multidrug transporter MdfA
Synonyms:
Chloramphenicol resistance pump cmr Multidrug translocase mdfA cmr | mdfA
Type:
PROTEIN
Mol. Mass.:
44327.48
Organism:
Escherichia coli (strain K12)
Description:
ChEMBL_68323
Residue:
410
  
Inhibitor
Name:
BDBM50368781
Synonyms:
Achromycin Liquamycin TETRACYCLINE
Type:
Small organic molecule
Emp. Form.:
C22H24N2O8
Mol. Mass.:
444.4346
SMILES:
CN(C)[C@H]1[C@@H]2C[C@H]3C(C(=O)c4c(O)cccc4[C@@]3(C)O)C(=O)[C@]2(O)C(=O)C(C(N)=O)C1=O
: