Target
D(2) dopamine receptor
Ligand
BDBM50036844
Substrate
Meas. Tech.
ChEMBL_59314 (CHEMBL670208)
IC50
30±n/a nM
Citation
 Podona, TGuardiola-Lemaître, BCaignard, DHAdam, GPfeiffer, BRenard, PGuillaumet, G 3,4-Dihydro-3-amino-2H-1-benzopyran derivatives as 5-HT1A receptor ligands and potential anxiolytic agents. 1. Synthesis and structure--activity relationship studies. J Med Chem 37:1779-93 (1994)  
Target
Name:
D(2) dopamine receptor
Synonyms:
DOPAMINE D2 DRD2_BOVIN | Dopamine D2 receptor
Type:
Enzyme Catalytic Domain
Mol. Mass.:
50698.79
Organism:
BOVINE
Description:
P20288
Residue:
444
  
Inhibitor
Name:
BDBM50036844
Synonyms:
2-{4-[(5-Methoxy-chroman-3-yl)-propyl-amino]-butyl}-isoindole-1,3-dione; compound with oxalic acid | CHEMBL52396
Type:
Small organic molecule
Emp. Form.:
C25H30N2O4
Mol. Mass.:
422.5167
SMILES:
CCCN(CCCCN1C(=O)c2ccccc2C1=O)C1COc2cccc(OC)c2C1
: